Target
C-C chemokine receptor type 5
Ligand
BDBM50313874
Substrate
Meas. Tech.
ChEMBL_615454 (CHEMBL1107772)
IC50
>500±n/a nM
Citation
 Lemoine, RCPetersen, ACSetti, LChen, LWanner, JJekle, AHeilek, GdeRosier, AJi, CRotstein, DM Evaluation of a 4-aminopiperidine replacement in several series of CCR5 antagonists. Bioorg Med Chem Lett 20:1830-3 (2010)  
Target
Name:
C-C chemokine receptor type 5
Synonyms:
C-C CKR-5 CC-CKR-5 CCR5 CCR5_HUMAN CHEMR13 HIV-1 fusion coreceptor
Type:
Enzyme
Mol. Mass.:
40540.21
Organism:
Homo sapiens (Human)
Description:
P51681
Residue:
352
  
Inhibitor
Name:
BDBM50313874
Synonyms:
(2,4-dimethylpyridin-3-yl)((3aR,6aS)-5-((S)-4-((R)-2-methoxy-1-(4-(trifluoromethyl)phenyl)ethyl)-3-methylpiperazin-1-yl)hexahydrocyclopenta[c]pyrrol-2(1H)-yl)methanone | CHEMBL1077351
Type:
Small organic molecule
Emp. Form.:
C30H39F3N4O2
Mol. Mass.:
544.6515
SMILES:
COC[C@H](N1CCN(C[C@@H]1C)C1C[C@H]2CN(C[C@H]2C1)C(=O)c1c(C)ccnc1C)c1ccc(cc1)C(F)(F)F
: