Target
Corticotropin-releasing factor receptor 1
Ligand
BDBM50314001
Substrate
Meas. Tech.
ChEMBL_615933 (CHEMBL1099779)
Ki
>5000±n/a nM
Citation
 Vrudhula, VMDasgupta, BPin, SSBurris, KDBalanda, LAFung, LKFiedler, TBrowman, KETaber, MTZhang, JMacor, JEDubowchik, GM Design, synthesis and evaluation of constrained tetrahydroimidazopyrimidine derivatives as antagonists of corticotropin-releasing factor type 1 receptor (CRF1R). Bioorg Med Chem Lett 20:1905-9 (2010)  
Target
Name:
Corticotropin-releasing factor receptor 1
Synonyms:
CRF-R CRF1 CRFR1 CRH-R 1 CRHR1 Corticotropin-releasing factor receptor 1 (CRF-1) Corticotropin-releasing hormone receptor 1
Type:
Enzyme
Mol. Mass.:
50744.31
Organism:
Homo sapiens (Human)
Description:
P34998
Residue:
444
  
Inhibitor
Name:
BDBM50314001
Synonyms:
8-mesityl-2-methyl-3-(morpholine-4-carbonyl)-5,6-dihydroimidazo[1,2-a]pyrimidin-7(8H)-one | CHEMBL1088326
Type:
Small organic molecule
Emp. Form.:
C21H26N4O3
Mol. Mass.:
382.4561
SMILES:
Cc1nc2N(C(=O)CCn2c1C(=O)N1CCOCC1)c1c(C)cc(C)cc1C
: