Target
Mitogen-activated protein kinase 14
Ligand
BDBM50314071
Substrate
Meas. Tech.
ChEMBL_627163 (CHEMBL1111805)
Kd
3.7±n/a nM
Citation
 Goldstein, DMKuglstatter, ALou, YSoth, MJ Selective p38alpha inhibitors clinically evaluated for the treatment of chronic inflammatory disorders. J Med Chem 53:2345-53 (2010)  
Target
Name:
Mitogen-activated protein kinase 14
Synonyms:
CSAID-binding protein CSBP1 CSPB1 MAP kinase 14 MAP kinase p38 alpha MAPK14 MK14_HUMAN Mitogen-activated protein kinase p38 alpha Stress-activated protein kinase 2a | p38 MAP kinase alpha/beta
Type:
Serine/threonine-protein kinase
Mol. Mass.:
41286.76
Organism:
Homo sapiens (Human)
Description:
Q16539
Residue:
360
  
Inhibitor
Name:
BDBM50314071
Synonyms:
2-(2,4-difluorophenyl)-6-(1-(2,6-difluorophenyl)ureido)nicotinamide VX-702
Type:
Small organic molecule
Emp. Form.:
C19H12F4N4O2
Mol. Mass.:
404.3178
SMILES:
NC(=O)N(c1ccc(C(N)=O)c(n1)-c1ccc(F)cc1F)c1c(F)cccc1F
: