Target
Histone deacetylase 3
Ligand
BDBM50314143
Substrate
Meas. Tech.
ChEMBL_623893 (CHEMBL1105416)
IC50
1750±n/a nM
Citation
 Oger, FLecorgne, ASala, ENardese, VDemay, FChevance, SDesravines, DCAleksandrova, NLe Guével, RLorenzi, SBeccari, ARBarath, PHart, DJBondon, ACarettoni, DSimonneaux, GSalbert, G Biological and biophysical properties of the histone deacetylase inhibitor suberoylanilide hydroxamic acid are affected by the presence of short alkyl groups on the phenyl ring. J Med Chem 53:1937-50 (2010)  
Target
Name:
Histone deacetylase 3
Synonyms:
HD3 HDAC3_HUMAN Human HDAC3 SMAP45
Type:
Enzyme
Mol. Mass.:
48829.55
Organism:
Homo sapiens (Human)
Description:
O15379
Residue:
428
  
Inhibitor
Name:
BDBM50314143
Synonyms:
CHEMBL1093043 | N-(2,3-Dimethylphenyl)-N'-hydroxyoctanediamide
Type:
Small organic molecule
Emp. Form.:
C14H20N2O3
Mol. Mass.:
264.3202
SMILES:
Cc1cccc(NC(=O)CCCCC(=O)NO)c1C
: