Target
Mitogen-activated protein kinase 10
Ligand
BDBM50314148
Substrate
Meas. Tech.
ChEMBL_624060 (CHEMBL1116946)
Ki
16±n/a nM
Citation
 Siddiqui, MAReddy, PA Small molecule JNK (c-Jun N-terminal kinase) inhibitors. J Med Chem 53:3005-12 (2010)  
Target
Name:
Mitogen-activated protein kinase 10
Synonyms:
JNK3 MAP kinase p49 3F12 MK10_HUMAN Mitogen-activated protein kinase 10 (Stress-activated protein kinase JNK3) (c-Jun N-terminal kinase 3) (MAP kinase p49 3F12) PRKM10 Stress-activated protein kinase JNK3 | c-Jun N-terminal kinase 3 (JNK3)
Type:
Enzyme
Mol. Mass.:
52586.89
Organism:
Homo sapiens (Human)
Description:
Residue:
464
  
Inhibitor
Name:
BDBM50314148
Synonyms:
CHEMBL1089007 | trans-4-(4-(3-(tetrahydro-2H-pyran-3-yl)-1H-pyrazol-4-yl)pyrimidin-2-ylamino)cyclohexanol
Type:
Small organic molecule
Emp. Form.:
C18H25N5O2
Mol. Mass.:
343.4234
SMILES:
O[C@H]1CC[C@@H](CC1)Nc1nccc(n1)-c1cn[nH]c1C1CCCOC1
: