Target
Cathepsin S
Ligand
BDBM50314165
Substrate
Meas. Tech.
ChEMBL_624072 (CHEMBL1103403)
IC50
340±n/a nM
Citation
 Lee-Dutra, AWiener, DKArienti, KLLiu, JMani, NAmeriks, MKAxe, FUGebauer, DDesai, PJNguyen, SRandal, MThurmond, RLSun, SKarlsson, LEdwards, JPJones, TKGrice, CA Discovery and SAR of novel pyrazole-based thioethers as cathepsin S inhibitors: part 1. Bioorg Med Chem Lett 20:2370-4 (2010)  
Target
Name:
Cathepsin S
Synonyms:
CATS_HUMAN Cathepsin S (Cat S) | cathepsin S preproprotein
Type:
Protein
Mol. Mass.:
37507.38
Organism:
Homo sapiens (Human)
Description:
P25774
Residue:
331
  
Inhibitor
Name:
BDBM50314165
Synonyms:
1-(1-(3-(3-(3-(2-(4-hydroxypiperidin-1-yl)ethylthio)-4-(trifluoromethyl)phenyl)-5-(methylsulfonyl)-4,5,6,7-tetrahydro-1H-pyrazolo[4,3-c]pyridin-1-yl)propyl)piperidin-4-yl)pyrrolidin-2-one | CHEMBL1093953
Type:
Small organic molecule
Emp. Form.:
C33H47F3N6O4S2
Mol. Mass.:
712.889
SMILES:
CS(=O)(=O)N1CCc2c(C1)c(nn2CCCN1CCC(CC1)N1CCCC1=O)-c1ccc(c(SCCN2CCC(O)CC2)c1)C(F)(F)F
: