Target
Cathepsin S
Ligand
BDBM50314161
Substrate
Meas. Tech.
ChEMBL_624073 (CHEMBL1103404)
IC50
130±n/a nM
Citation
 Lee-Dutra, AWiener, DKArienti, KLLiu, JMani, NAmeriks, MKAxe, FUGebauer, DDesai, PJNguyen, SRandal, MThurmond, RLSun, SKarlsson, LEdwards, JPJones, TKGrice, CA Discovery and SAR of novel pyrazole-based thioethers as cathepsin S inhibitors: part 1. Bioorg Med Chem Lett 20:2370-4 (2010)  
Target
Name:
Cathepsin S
Synonyms:
CATS_HUMAN Cathepsin S (Cat S) | cathepsin S preproprotein
Type:
Protein
Mol. Mass.:
37507.38
Organism:
Homo sapiens (Human)
Description:
P25774
Residue:
331
  
Inhibitor
Name:
BDBM50314161
Synonyms:
1-(1-(3-(3-(3-(2-(4-methylpiperazin-1-yl)ethylthio)-4-(trifluoromethyl)phenyl)-5-(methylsulfonyl)-4,5,6,7-tetrahydro-1H-pyrazolo[4,3-c]pyridin-1-yl)propyl)piperidin-4-yl)pyrrolidin-2-one | CHEMBL1093949
Type:
Small organic molecule
Emp. Form.:
C33H48F3N7O3S2
Mol. Mass.:
711.905
SMILES:
CN1CCN(CCSc2cc(ccc2C(F)(F)F)-c2nn(CCCN3CCC(CC3)N3CCCC3=O)c3CCN(Cc23)S(C)(=O)=O)CC1
: