Target
Cathepsin S
Ligand
BDBM50314194
Substrate
Meas. Tech.
ChEMBL_624074 (CHEMBL1103405)
IC50
40±n/a nM
Citation
 Wiener, JJWickboldt, ATWiener, DKLee-Dutra, AEdwards, JPKarlsson, LNguyen, SSun, SJones, TKGrice, CA Discovery and SAR of novel pyrazole-based thioethers as cathepsin S inhibitors. Part 2: Modification of P3, P4, and P5 regions. Bioorg Med Chem Lett 20:2375-8 (2010)  
Target
Name:
Cathepsin S
Synonyms:
CATS_HUMAN Cathepsin S (Cat S) | cathepsin S preproprotein
Type:
Protein
Mol. Mass.:
37507.38
Organism:
Homo sapiens (Human)
Description:
P25774
Residue:
331
  
Inhibitor
Name:
BDBM50314194
Synonyms:
(+/-)-1-(1-(2-hydroxy-3-(5-(methylsulfonyl)-3-(3-(2-(piperidin-1-yl)ethylthio)-4-(trifluoromethyl)phenyl)-4,5,6,7-tetrahydro-1H-pyrazolo[4,3-c]pyridin-1-yl)propyl)piperidin-4-yl)pyrrolidin-2-one | CHEMBL1089290
Type:
Small organic molecule
Emp. Form.:
C33H47F3N6O4S2
Mol. Mass.:
712.889
SMILES:
CS(=O)(=O)N1CCc2c(C1)c(nn2CC(O)CN1CCC(CC1)N1CCCC1=O)-c1ccc(c(SCCN2CCCCC2)c1)C(F)(F)F
: