Target
Cathepsin S
Ligand
BDBM50314242
Substrate
Meas. Tech.
ChEMBL_624117 (CHEMBL1103448)
IC50
10±n/a nM
Citation
 Wiener, DKLee-Dutra, ABembenek, SNguyen, SThurmond, RLSun, SKarlsson, LGrice, CAJones, TKEdwards, JP Thioether acetamides as P3 binding elements for tetrahydropyrido-pyrazole cathepsin S inhibitors. Bioorg Med Chem Lett 20:2379-82 (2010)  
Target
Name:
Cathepsin S
Synonyms:
CATS_HUMAN Cathepsin S (Cat S) | cathepsin S preproprotein
Type:
Protein
Mol. Mass.:
37507.38
Organism:
Homo sapiens (Human)
Description:
P25774
Residue:
331
  
Inhibitor
Name:
BDBM50314242
Synonyms:
CHEMBL1090988 | rac-2-hydroxy-1-(1-(2-hydroxy-3-(4-(pyridin-2-yl)piperidin-1-yl)propyl)-3-(3-(2-morpholino-2-oxoethylthio)-4-(trifluoromethyl)phenyl)-6,7-dihydro-1H-pyrazolo[4,3-c]pyridin-5(4H)-yl)ethanone
Type:
Small organic molecule
Emp. Form.:
C34H41F3N6O5S
Mol. Mass.:
702.787
SMILES:
OCC(=O)N1CCc2c(C1)c(nn2CC(O)CN1CCC(CC1)c1ccccn1)-c1ccc(c(SCC(=O)N2CCOCC2)c1)C(F)(F)F
: