Target
Cathepsin S
Ligand
BDBM50314244
Substrate
Meas. Tech.
ChEMBL_624118 (CHEMBL1103449)
IC50
60±n/a nM
Citation
 Wiener, DKLee-Dutra, ABembenek, SNguyen, SThurmond, RLSun, SKarlsson, LGrice, CAJones, TKEdwards, JP Thioether acetamides as P3 binding elements for tetrahydropyrido-pyrazole cathepsin S inhibitors. Bioorg Med Chem Lett 20:2379-82 (2010)  
Target
Name:
Cathepsin S
Synonyms:
CATS_HUMAN Cathepsin S (Cat S) | cathepsin S preproprotein
Type:
Protein
Mol. Mass.:
37507.38
Organism:
Homo sapiens (Human)
Description:
P25774
Residue:
331
  
Inhibitor
Name:
BDBM50314244
Synonyms:
CHEMBL1090986 | rac-2-(5-(1-(2-hydroxy-3-(4-(pyridin-2-yl)piperidin-1-yl)propyl)-4,5,6,7-tetrahydro-1H-pyrazolo[4,3-c]pyridin-3-yl)-2-(trifluoromethyl)phenylthio)-1-(pyrrolidin-1-yl)ethanone
Type:
Small organic molecule
Emp. Form.:
C32H39F3N6O2S
Mol. Mass.:
628.751
SMILES:
OC(CN1CCC(CC1)c1ccccn1)Cn1nc(c2CNCCc12)-c1ccc(c(SCC(=O)N2CCCC2)c1)C(F)(F)F
: