Target
5-hydroxytryptamine receptor 2B
Ligand
BDBM50314613
Substrate
Meas. Tech.
ChEMBL_625152 (CHEMBL1115173)
Ki
3940±n/a nM
Citation
 Liu, KKLefker, BADombroski, MAChiang, PCornelius, PPatterson, TAZeng, YSantucci, STomlinson, EGibbons, CPMarala, RBrown, JAKong, JXLee, EWerner, WWenzel, ZGiragossian, CChen, HCoffey, SB Orally active and brain permeable proline amides as highly selective 5HT2c agonists for the treatment of obesity. Bioorg Med Chem Lett 20:2365-9 (2010)  
Target
Name:
5-hydroxytryptamine receptor 2B
Synonyms:
5-HT-2B 5-hydroxytryptamine (serotonin) receptor 2B [Homo sapiens] 5-hydroxytryptamine receptor 2C (5HT2C) HTR2B Serotonin 2b (5-HT2b) receptor | Serotonin Receptor 2B
Type:
G Protein-Coupled Receptor (GPCR)
Mol. Mass.:
54312.47
Organism:
Homo sapiens (Human)
Description:
Receptor binding assays were performed using human clone stably expressed in CHO cells.
Residue:
481
  
Inhibitor
Name:
BDBM50314613
Synonyms:
(S)-N-(4-(4,4-dimethylcyclohexyloxy)-5-fluoro-2-methoxybenzyl)pyrrolidine-2-carboxamide | CHEMBL1091105
Type:
Small organic molecule
Emp. Form.:
C21H31FN2O3
Mol. Mass.:
378.4808
SMILES:
COc1cc(OC2CCC(C)(C)CC2)c(F)cc1CNC(=O)[C@@H]1CCCN1
: