Target
Acetyl-CoA carboxylase 2
Ligand
BDBM50314938
Substrate
Meas. Tech.
ChEMBL_627704 (CHEMBL1115284)
IC50
4.5±n/a nM
Citation
 Corbett, JWFreeman-Cook, KDElliott, RVajdos, FRajamohan, FKohls, DMarr, EZhang, HTong, LTu, MMurdande, SDoran, SDHouser, JASong, WJones, CJCoffey, SBBuzon, LMinich, MLDirico, KJTapley, SMcPherson, RKSugarman, EHarwood, HJEsler, W Discovery of small molecule isozyme non-specific inhibitors of mammalian acetyl-CoA carboxylase 1 and 2. Bioorg Med Chem Lett 20:2383-8 (2010)  
Target
Name:
Acetyl-CoA carboxylase 2
Synonyms:
ACACB ACC-beta ACCB Acetyl-CoA carboxylase 2 Acetyl-CoA carboxylase 2 (ACC2)
Type:
Protein
Mol. Mass.:
276535.21
Organism:
Homo sapiens (Human)
Description:
O00763
Residue:
2458
  
Inhibitor
Name:
BDBM50314938
Synonyms:
5'-isopropoxy-1-(7-methyl-1H-indazole-5-carbonyl)spiro[piperidine-4,2'-pyrano[3,2-c]pyridin]-4'(3'H)-one | CHEMBL1089181
Type:
Small organic molecule
Emp. Form.:
C24H26N4O4
Mol. Mass.:
434.4876
SMILES:
CC(C)Oc1nccc2OC3(CCN(CC3)C(=O)c3cc(C)c4[nH]ncc4c3)CC(=O)c12
: