Target
Catechol O-methyltransferase
Ligand
BDBM50315226
Substrate
Meas. Tech.
ChEMBL_625415 (CHEMBL1116964)
Ki
10.2±n/a nM
Citation
 Rautio, JLeppänen, JLehtonen, MLaine, KKoskinen, MPystynen, JSavolainen, JSairanen, M Design, synthesis and in vitro/in vivo evaluation of orally bioavailable prodrugs of a catechol-O-methyltransferase inhibitor. Bioorg Med Chem Lett 20:2614-6 (2010)  
Target
Name:
Catechol O-methyltransferase
Synonyms:
COMT Catechol O-methyltransferase | Catechol O-methyltransferase (MB-COMT)
Type:
Enzyme
Mol. Mass.:
30030.67
Organism:
Homo sapiens (Human)
Description:
P21964
Residue:
271
  
Inhibitor
Name:
BDBM50315226
Synonyms:
Benzyl-3-chloro-5,6-dihydroxy-7-nitrobenzo[b]thiophene-2-carboxylate | CHEMBL1089536
Type:
Small organic molecule
Emp. Form.:
C16H10ClNO6S
Mol. Mass.:
379.772
SMILES:
Oc1cc2c(Cl)c(sc2c(c1O)[N+]([O-])=O)C(=O)OCc1ccccc1
: