Target
Catechol O-methyltransferase
Ligand
BDBM50315229
Substrate
Meas. Tech.
ChEMBL_625415 (CHEMBL1116964)
Ki
9.2±n/a nM
Citation
 Rautio, JLeppänen, JLehtonen, MLaine, KKoskinen, MPystynen, JSavolainen, JSairanen, M Design, synthesis and in vitro/in vivo evaluation of orally bioavailable prodrugs of a catechol-O-methyltransferase inhibitor. Bioorg Med Chem Lett 20:2614-6 (2010)  
Target
Name:
Catechol O-methyltransferase
Synonyms:
COMT Catechol O-methyltransferase | Catechol O-methyltransferase (MB-COMT)
Type:
Enzyme
Mol. Mass.:
30030.67
Organism:
Homo sapiens (Human)
Description:
P21964
Residue:
271
  
Inhibitor
Name:
BDBM50315229
Synonyms:
CHEMBL1089505 | Propyl-3-chloro-5,6-dihydroxy-7-nitrobenzo[b]thiophene-2-carboxylate
Type:
Small organic molecule
Emp. Form.:
C12H10ClNO6S
Mol. Mass.:
331.729
SMILES:
CCCOC(=O)c1sc2c(c(O)c(O)cc2c1Cl)[N+]([O-])=O
: