Target
Tyrosine-protein kinase JAK3
Ligand
BDBM50315240
Substrate
Meas. Tech.
ChEMBL_625436 (CHEMBL1116985)
IC50
280±n/a nM
Citation
 Pissot-Soldermann, CGerspacher, MFuret, PGaul, CHolzer, PMcCarthy, CRadimerski, TRegnier, CHBaffert, FDrueckes, PTavares, GAVangrevelinghe, EBlasco, FOttaviani, GOssola, FScesa, JReetz, J Discovery and SAR of potent, orally available 2,8-diaryl-quinoxalines as a new class of JAK2 inhibitors. Bioorg Med Chem Lett 20:2609-13 (2010)  
Target
Name:
Tyrosine-protein kinase JAK3
Synonyms:
JAK-3 JAK3_HUMAN Janus kinase 3 (JAK3) L-JAK | Leukocyte janus kinase
Type:
Protein
Mol. Mass.:
125111.08
Organism:
Homo sapiens (Human)
Description:
P52333
Residue:
1124
  
Inhibitor
Name:
BDBM50315240
Synonyms:
1-(1,1-Dioxo-1lambda*6*-thiomorpholin-4-yl)-2-{4-[3-(3,4,5-trimethoxy-phenyl)-quinoxalin-5-yl]-phenyl}-ethanone | CHEMBL1093468
Type:
Small organic molecule
Emp. Form.:
C29H29N3O6S
Mol. Mass.:
547.622
SMILES:
COc1cc(cc(OC)c1OC)-c1cnc2cccc(-c3ccc(CC(=O)N4CCS(=O)(=O)CC4)cc3)c2n1
: