Target
Non-receptor tyrosine-protein kinase TYK2
Ligand
BDBM50315245
Substrate
Meas. Tech.
ChEMBL_625437 (CHEMBL1116986)
IC50
>10000±n/a nM
Citation
 Pissot-Soldermann, CGerspacher, MFuret, PGaul, CHolzer, PMcCarthy, CRadimerski, TRegnier, CHBaffert, FDrueckes, PTavares, GAVangrevelinghe, EBlasco, FOttaviani, GOssola, FScesa, JReetz, J Discovery and SAR of potent, orally available 2,8-diaryl-quinoxalines as a new class of JAK2 inhibitors. Bioorg Med Chem Lett 20:2609-13 (2010)  
Target
Name:
Non-receptor tyrosine-protein kinase TYK2
Synonyms:
Non-receptor tyrosine-protein kinase TYK2 (TYK2) TYK2_HUMAN | Tyrosine-protein kinase TYK2
Type:
Protein
Mol. Mass.:
133666.03
Organism:
Homo sapiens (Human)
Description:
P29597
Residue:
1187
  
Inhibitor
Name:
BDBM50315245
Synonyms:
4-(4-(3-(3,4,5-trimethoxyphenyl)quinoxalin-5-yl)benzyl)morpholine | CHEMBL1092588
Type:
Small organic molecule
Emp. Form.:
C28H29N3O4
Mol. Mass.:
471.5476
SMILES:
COc1cc(cc(OC)c1OC)-c1cnc2cccc(-c3ccc(CN4CCOCC4)cc3)c2n1
: