Target
Gonadotropin-releasing hormone receptor
Ligand
BDBM50261251
Substrate
Meas. Tech.
ChEMBL_625917 (CHEMBL1115143)
IC50
10±n/a nM
Citation
 Vera, MDLundquist, JTChengalvala, MVCottom, JEFeingold, IBGarrick, LMGreen, DMHauze, DBMann, CWMehlmann, JFRogers, JFShanno, LWrobel, JEPelletier, JC Synthesis and biological evaluation of piperazinyl heterocyclic antagonists of the gonadotropin releasing hormone (GnRH) receptor. Bioorg Med Chem Lett 20:2512-5 (2010)  
Target
Name:
Gonadotropin-releasing hormone receptor
Synonyms:
GNRHR GRHR GnRH-R Gonadotropin-releasing hormone receptor | Gonadotropin-releasing hormone receptor (GnRH)
Type:
Enzyme
Mol. Mass.:
37749.45
Organism:
Homo sapiens (Human)
Description:
P30968
Residue:
328
  
Inhibitor
Name:
BDBM50261251
Synonyms:
2-(4-tert-butylphenyl)-4-(4-((2-ethyl-4-methyl-1H-imidazol-5-yl)methyl)piperazin-1-yl)-1H-benzo[d]imidazole CHEMBL468565
Type:
Small organic molecule
Emp. Form.:
C28H36N6
Mol. Mass.:
456.6256
SMILES:
CCc1nc(C)c(CN2CCN(CC2)c2cccc3[nH]c(nc23)-c2ccc(cc2)C(C)(C)C)[nH]1
: