Target
Sphingosine 1-phosphate receptor 4
Ligand
BDBM50249266
Substrate
Meas. Tech.
ChEMBL_627322 (CHEMBL1108114)
IC50
4.87±n/a nM
Citation
 Evindar, GBernier, SGDoyle, EKavarana, MJSatz, ALLorusso, JBlanchette, HSSaha, AKHannig, GMorgan, BAWestlin, WF Exploration of amino alcohol derivatives as novel, potent, and highly selective sphingosine-1-phosphate receptor subtype-1 agonists. Bioorg Med Chem Lett 20:2520-4 (2010)  
Target
Name:
Sphingosine 1-phosphate receptor 4
Synonyms:
EDG6 S1P receptor 4 S1P4 S1PR4_HUMAN Sphingosine 1-phosphate receptor Edg-6 sphingosine-1-phosphate 4 S1P4
Type:
G Protein-Coupled Receptor (GPCR)
Mol. Mass.:
41647.39
Organism:
Homo sapiens (Human)
Description:
Residue:
384
  
Inhibitor
Name:
BDBM50249266
Synonyms:
(R)-2-amino-2-(4-(4-(biphenyl-4-ylmethoxy)phenyl)-1H-imidazol-2-yl)propyl dihydrogen phosphate | CHEMBL514170
Type:
Small organic molecule
Emp. Form.:
C25H26N3O5P
Mol. Mass.:
479.4648
SMILES:
C[C@](N)(COP(O)(O)=O)c1nc(c[nH]1)-c1ccc(OCc2ccc(cc2)-c2ccccc2)cc1
: