Target
Serine/threonine-protein kinase B-raf
Ligand
BDBM50315651
Substrate
Meas. Tech.
ChEMBL_623798 (CHEMBL1117081)
IC50
1110±n/a nM
Citation
 Gopalsamy, AShi, MHu, YLee, FFeldberg, LFrommer, EKim, SCollins, KWojciechowicz, DMallon, R B-Raf kinase inhibitors: hit enrichment through scaffold hopping. Bioorg Med Chem Lett 20:2431-4 (2010)  
Target
Name:
Serine/threonine-protein kinase B-raf
Synonyms:
B-RAF B-Raf proto-oncogene serine/threonine-protein kinase BRAF1 RAFB1 v-Raf murine sarcoma viral oncogene homolog B1
Type:
Serine/threonine-protein kinase
Mol. Mass.:
84446.00
Organism:
Homo sapiens (Human)
Description:
P15056
Residue:
766
  
Inhibitor
Name:
BDBM50315651
Synonyms:
CHEMBL1093588 | N-(3-(6-(pyridin-3-yl)thieno[2,3-d]pyrimidin-4-yl)phenyl)-3-(trifluoromethyl)benzamide
Type:
Small organic molecule
Emp. Form.:
C25H15F3N4OS
Mol. Mass.:
476.473
SMILES:
FC(F)(F)c1cccc(c1)C(=O)Nc1cccc(c1)-c1ncnc2sc(cc12)-c1cccnc1
: