Target
Poly [ADP-ribose] polymerase 1
Ligand
BDBM50315791
Substrate
Meas. Tech.
ChEMBL_625252 (CHEMBL1106195)
EC50
26±n/a nM
Citation
 Penning, TDZhu, GDGong, JThomas, SGandhi, VBLiu, XShi, YKlinghofer, VJohnson, EFPark, CHFry, EHDonawho, CKFrost, DJBuchanan, FGBukofzer, GTRodriguez, LEBontcheva-Diaz, VBouska, JJOsterling, DJOlson, AMMarsh, KCLuo, YGiranda, VL Optimization of phenyl-substituted benzimidazole carboxamide poly(ADP-ribose) polymerase inhibitors: identification of (S)-2-(2-fluoro-4-(pyrrolidin-2-yl)phenyl)-1H-benzimidazole-4-carboxamide (A-966492), a highly potent and efficacious inhibitor. J Med Chem 53:3142-53 (2010)  
Target
Name:
Poly [ADP-ribose] polymerase 1
Synonyms:
(ARTD1 or PARP1) 2.4.2.30 ADPRT ARTD1 Human diphtheria toxin-like ADP-ribosyltransferase (ARTD1 or PARP1) NT-PARP-1 PARP1 PPOL Poly [ADP-ribose] polymerase 1 (PARP) Poly [ADP-ribose] polymerase 1 (PARP1) Poly [ADP-ribose] polymerase 1, 28-kDa form Poly [ADP-ribose] polymerase 1, processed C-terminus Poly [ADP-ribose] polymerase-1 Poly(ADP-ribose) polymerase-1 (ARTD1/PARP1) Protein poly-ADP-ribosyltransferase PARP1 | Synonyms=ADPRT
Type:
Mol. Mass.:
113114.22
Organism:
Homo sapiens (Human)
Description:
P09874
Residue:
1014
  
Inhibitor
Name:
BDBM50315791
Synonyms:
6-Chloro-2-(4-pyrrolidin-2-ylphenyl)-1H-benzimidazole-4-carboxamide | CHEMBL1092226
Type:
Small organic molecule
Emp. Form.:
C18H17ClN4O
Mol. Mass.:
340.807
SMILES:
NC(=O)c1cc(Cl)cc2[nH]c(nc12)-c1ccc(cc1)C1CCCN1
: