Target
Receptor tyrosine-protein kinase erbB-2
Ligand
BDBM50315885
Substrate
Meas. Tech.
ChEMBL_624980 (CHEMBL1108836)
IC50
310±n/a nM
Citation
 Fidanze, SDErickson, SAWang, GTMantei, RClark, RFSorensen, BKBamaung, NYKovar, PJohnson, EFSwinger, KKStewart, KDZhang, QTucker, LAPappano, WNWilsbacher, JLWang, JSheppard, GSBell, RLDavidsen, SKHubbard, RD Imidazo[2,1-b]thiazoles: multitargeted inhibitors of both the insulin-like growth factor receptor and members of the epidermal growth factor family of receptor tyrosine kinases. Bioorg Med Chem Lett 20:2452-5 (2010)  
Target
Name:
Receptor tyrosine-protein kinase erbB-2
Synonyms:
2.7.10.1 CD_antigen=CD340 ERBB2_HUMAN FASN/HER2 HER2 MLN19 NEU Proto-oncogene Neu Tyrosine kinase-type cell surface receptor HER2 | p185erbB2
Type:
Mol. Mass.:
137894.47
Organism:
Homo sapiens (Human)
Description:
P04626
Residue:
1255
  
Inhibitor
Name:
BDBM50315885
Synonyms:
CHEMBL1090362 | N-(3-(5-(2-(4-(4-ethylpiperazin-1-yl)phenylamino)pyrimidin-4-yl)imidazo[2,1-b]thiazol-6-yl)phenyl)-2-phenylacetamide
Type:
Small organic molecule
Emp. Form.:
C35H34N8OS
Mol. Mass.:
614.762
SMILES:
CCN1CCN(CC1)c1ccc(Nc2nccc(n2)-c2c(nc3sccn23)-c2cccc(NC(=O)Cc3ccccc3)c2)cc1
: