Target
Receptor tyrosine-protein kinase erbB-2
Ligand
BDBM50315892
Substrate
Meas. Tech.
ChEMBL_624977 (CHEMBL1108833)
IC50
170±n/a nM
Citation
 Fidanze, SDErickson, SAWang, GTMantei, RClark, RFSorensen, BKBamaung, NYKovar, PJohnson, EFSwinger, KKStewart, KDZhang, QTucker, LAPappano, WNWilsbacher, JLWang, JSheppard, GSBell, RLDavidsen, SKHubbard, RD Imidazo[2,1-b]thiazoles: multitargeted inhibitors of both the insulin-like growth factor receptor and members of the epidermal growth factor family of receptor tyrosine kinases. Bioorg Med Chem Lett 20:2452-5 (2010)  
Target
Name:
Receptor tyrosine-protein kinase erbB-2
Synonyms:
2.7.10.1 CD_antigen=CD340 ERBB2_HUMAN FASN/HER2 HER2 MLN19 NEU Proto-oncogene Neu Tyrosine kinase-type cell surface receptor HER2 | p185erbB2
Type:
Mol. Mass.:
137894.47
Organism:
Homo sapiens (Human)
Description:
P04626
Residue:
1255
  
Inhibitor
Name:
BDBM50315892
Synonyms:
CHEMBL1090355 | phenyl 3-(5-(2-(4-morpholinophenylamino)pyrimidin-4-yl)imidazo[2,1-b]thiazol-6-yl)phenylcarbamate
Type:
Small organic molecule
Emp. Form.:
C32H27N7O3S
Mol. Mass.:
589.667
SMILES:
O=C(Nc1cccc(c1)-c1nc2sccn2c1-c1ccnc(Nc2ccc(cc2)N2CCOCC2)n1)Oc1ccccc1
: