Target
Insulin-like growth factor 1 receptor
Ligand
BDBM50315899
Substrate
Meas. Tech.
ChEMBL_624976 (CHEMBL1108832)
IC50
46±n/a nM
Citation
 Fidanze, SDErickson, SAWang, GTMantei, RClark, RFSorensen, BKBamaung, NYKovar, PJohnson, EFSwinger, KKStewart, KDZhang, QTucker, LAPappano, WNWilsbacher, JLWang, JSheppard, GSBell, RLDavidsen, SKHubbard, RD Imidazo[2,1-b]thiazoles: multitargeted inhibitors of both the insulin-like growth factor receptor and members of the epidermal growth factor family of receptor tyrosine kinases. Bioorg Med Chem Lett 20:2452-5 (2010)  
Target
Name:
Insulin-like growth factor 1 receptor
Synonyms:
CD_antigen=CD221 IGF1R Insulin-like growth factor 1 receptor (IGF1R) Insulin-like growth factor 1 receptor alpha chain Insulin-like growth factor I receptor | Insulin-like growth factor receptor (IGFR)
Type:
Protein
Mol. Mass.:
154776.79
Organism:
Homo sapiens (Human)
Description:
P08069
Residue:
1367
  
Inhibitor
Name:
BDBM50315899
Synonyms:
CHEMBL1090363 | N-(3-(5-(2-(3-(2-(dimethylamino)ethyl)phenylamino)pyrimidin-4-yl)imidazo[2,1-b]thiazol-6-yl)phenyl)-2-phenylacetamide
Type:
Small organic molecule
Emp. Form.:
C33H31N7OS
Mol. Mass.:
573.711
SMILES:
CN(C)CCc1cccc(Nc2nccc(n2)-c2c(nc3sccn23)-c2cccc(NC(=O)Cc3ccccc3)c2)c1
: