Target
Serine/threonine-protein kinase PLK3
Ligand
BDBM50315888
Substrate
Meas. Tech.
ChEMBL_625005 (CHEMBL1109673)
IC50
>1000±n/a nM
Citation
 Fidanze, SDErickson, SAWang, GTMantei, RClark, RFSorensen, BKBamaung, NYKovar, PJohnson, EFSwinger, KKStewart, KDZhang, QTucker, LAPappano, WNWilsbacher, JLWang, JSheppard, GSBell, RLDavidsen, SKHubbard, RD Imidazo[2,1-b]thiazoles: multitargeted inhibitors of both the insulin-like growth factor receptor and members of the epidermal growth factor family of receptor tyrosine kinases. Bioorg Med Chem Lett 20:2452-5 (2010)  
Target
Name:
Serine/threonine-protein kinase PLK3
Synonyms:
CNK FGF-inducible kinase PLK3 PRK Proliferation-related kinase | Serine/threonine-protein kinase PLK3
Type:
Serine/threonine-protein kinase
Mol. Mass.:
71655.17
Organism:
Homo sapiens (Human)
Description:
Enzyme assays were using PLK3 purified from baculovirus-infected Trichoplusia ni cells expressing full-length PLK3.
Residue:
646
  
Inhibitor
Name:
BDBM50315888
Synonyms:
CHEMBL1090360 | N-(3-(5-(2-(3-morpholinophenylamino)pyrimidin-4-yl)imidazo[2,1-b]thiazol-6-yl)phenyl)-2-phenylacetamide
Type:
Small organic molecule
Emp. Form.:
C33H29N7O2S
Mol. Mass.:
587.694
SMILES:
O=C(Cc1ccccc1)Nc1cccc(c1)-c1nc2sccn2c1-c1ccnc(Nc2cccc(c2)N2CCOCC2)n1
: