Target
Insulin-like growth factor 1 receptor
Ligand
BDBM50315902
Substrate
Meas. Tech.
ChEMBL_624976 (CHEMBL1108832)
IC50
>12500±n/a nM
Citation
 Fidanze, SDErickson, SAWang, GTMantei, RClark, RFSorensen, BKBamaung, NYKovar, PJohnson, EFSwinger, KKStewart, KDZhang, QTucker, LAPappano, WNWilsbacher, JLWang, JSheppard, GSBell, RLDavidsen, SKHubbard, RD Imidazo[2,1-b]thiazoles: multitargeted inhibitors of both the insulin-like growth factor receptor and members of the epidermal growth factor family of receptor tyrosine kinases. Bioorg Med Chem Lett 20:2452-5 (2010)  
Target
Name:
Insulin-like growth factor 1 receptor
Synonyms:
CD_antigen=CD221 IGF1R Insulin-like growth factor 1 receptor (IGF1R) Insulin-like growth factor 1 receptor alpha chain Insulin-like growth factor I receptor | Insulin-like growth factor receptor (IGFR)
Type:
Protein
Mol. Mass.:
154776.79
Organism:
Homo sapiens (Human)
Description:
P08069
Residue:
1367
  
Inhibitor
Name:
BDBM50315902
Synonyms:
2-chloro-N-(3-(5-(2-(phenylamino)pyrimidin-4-yl)imidazo[2,1-b]thiazol-6-yl)phenyl)benzamide | CHEMBL1093815
Type:
Small organic molecule
Emp. Form.:
C28H19ClN6OS
Mol. Mass.:
523.008
SMILES:
Clc1ccccc1C(=O)Nc1cccc(c1)-c1nc2sccn2c1-c1ccnc(Nc2ccccc2)n1
: