Target
Phosphatidylinositol 4,5-bisphosphate 3-kinase catalytic subunit delta isoform
Ligand
BDBM50315907
Substrate
Meas. Tech.
ChEMBL_625060 (CHEMBL1111663)
IC50
6±n/a nM
Citation
 Heffron, TPBerry, MCastanedo, GChang, CChuckowree, IDotson, JFolkes, AGunzner, JLesnick, JDLewis, CMathieu, SNonomiya, JOlivero, APang, JPeterson, DSalphati, LSampath, DSideris, SSutherlin, DPTsui, VWan, NCWang, SWong, SZhu, BY Identification of GNE-477, a potent and efficacious dual PI3K/mTOR inhibitor. Bioorg Med Chem Lett 20:2408-11 (2010)  
Target
Name:
Phosphatidylinositol 4,5-bisphosphate 3-kinase catalytic subunit delta isoform
Synonyms:
PI3-kinase p110 subunit delta PI3-kinase subunit p110-delta PIK3CD Phosphatidylinositol 4,5-biphosphate 3-kinase catalytic subunit delta (PIK3CD) Phosphatidylinositol 4,5-bisphosphate 3-kinase 110 kDa catalytic subunit delta (PI3K delta) Phosphatidylinositol 4,5-bisphosphate 3-kinase catalytic subunit delta (PI3Kdelta) Phosphatidylinositol 4,5-bisphosphate 3-kinase catalytic subunit delta isoform (PI3K delta) Phosphatidylinositol 4,5-bisphosphate 3-kinase catalytic subunit delta isoform (PI3K-delta) Phosphatidylinositol 4,5-bisphosphate 3-kinase catalytic subunit delta isoform (PI3Kdelta)
Type:
Enzyme Subunit
Mol. Mass.:
119489.41
Organism:
Homo sapiens (Human)
Description:
O00329
Residue:
1044
  
Inhibitor
Name:
BDBM50315907
Synonyms:
5-(7-methyl-6-((4-(methylsulfonyl)piperazin-1-yl)methyl)-4-morpholinothieno[3,2-d]pyrimidin-2-yl)pyrimidin-2-amine | CHEMBL1091978
Type:
Small organic molecule
Emp. Form.:
C21H28N8O3S2
Mol. Mass.:
504.629
SMILES:
Cc1c(CN2CCN(CC2)S(C)(=O)=O)sc2c(nc(nc12)-c1cnc(N)nc1)N1CCOCC1
: