Target
Serine/threonine-protein kinase mTOR
Ligand
BDBM50315914
Substrate
Meas. Tech.
ChEMBL_625039 (CHEMBL1109707)
Ki
4±n/a nM
Citation
 Heffron, TPBerry, MCastanedo, GChang, CChuckowree, IDotson, JFolkes, AGunzner, JLesnick, JDLewis, CMathieu, SNonomiya, JOlivero, APang, JPeterson, DSalphati, LSampath, DSideris, SSutherlin, DPTsui, VWan, NCWang, SWong, SZhu, BY Identification of GNE-477, a potent and efficacious dual PI3K/mTOR inhibitor. Bioorg Med Chem Lett 20:2408-11 (2010)  
Target
Name:
Serine/threonine-protein kinase mTOR
Synonyms:
FK506-binding protein 12-rapamycin complex-associated protein 1 FRAP FRAP1 MTOR Mammalian Target of Rapamycin (mTOR) RAFT1 Rapamycin and FKBP12 target 1 Serine/threonine-protein kinase (mTOR) | mTORC2
Type:
Rapamycin target protein
Mol. Mass.:
288917.12
Organism:
Homo sapiens (Human)
Description:
P42345
Residue:
2549
  
Inhibitor
Name:
BDBM50315914
Synonyms:
(3-(2-(2-aminopyrimidin-5-yl)-7-methyl-4-morpholinothieno[3,2-d]pyrimidin-6-yl)phenyl)(4-methylpiperazin-1-yl)methanone | CHEMBL1093267
Type:
Small organic molecule
Emp. Form.:
C27H30N8O2S
Mol. Mass.:
530.645
SMILES:
CN1CCN(CC1)C(=O)c1cccc(c1)-c1sc2c(nc(nc2c1C)-c1cnc(N)nc1)N1CCOCC1
: