Target
Glycine receptor subunit alpha-1
Ligand
BDBM50316020
Substrate
Meas. Tech.
ChEMBL_625805 (CHEMBL1107103)
EC50
1200±n/a nM
Citation
 Balansa, WIslam, RFontaine, FPiggott, AMZhang, HWebb, TIGilbert, DFLynch, JWCapon, RJ Ircinialactams: subunit-selective glycine receptor modulators from Australian sponges of the family Irciniidae. Bioorg Med Chem 18:2912-9 (2010)  
Target
Name:
Glycine receptor subunit alpha-1
Synonyms:
GLRA1 Glycine receptor 48 kDa subunit | Glycine receptor strychnine-binding subunit
Type:
Enzyme Catalytic Domain
Mol. Mass.:
52635.39
Organism:
Homo sapiens (Human)
Description:
P23415
Residue:
457
  
Inhibitor
Name:
BDBM50316020
Synonyms:
(12E,20Z,18S)-8-hydroxyvariabilin CHEMBL464651
Type:
Small organic molecule
Emp. Form.:
C25H36O5
Mol. Mass.:
416.5503
SMILES:
C[C@@H](CCC\C(C)=C\CCC(C)(O)CCCc1ccoc1)C=C1OC(=O)C(C)C1=O
: