Target
RAC-gamma serine/threonine-protein kinase
Ligand
BDBM25013
Substrate
Meas. Tech.
ChEMBL_628225 (CHEMBL1109954)
IC50
9±n/a nM
Citation
 Rouse, MBSeefeld, MALeber, JDMcNulty, KCSun, LMiller, WHZhang, SMinthorn, EAConcha, NOChoudhry, AESchaber, MDHeerding, DA Aminofurazans as potent inhibitors of AKT kinase. Bioorg Med Chem Lett 19:1508-11 (2009)  
Target
Name:
RAC-gamma serine/threonine-protein kinase
Synonyms:
AKT3 PKB gamma Protein kinase Akt-3 Protein kinase B, gamma RAC-gamma serine/threonine-protein kinase Serine/threonine-protein kinase AKT | Serine/threonine-protein kinase AKT3
Type:
Enzyme
Mol. Mass.:
55769.36
Organism:
Homo sapiens (Human)
Description:
Residue:
479
  
Inhibitor
Name:
BDBM25013
Synonyms:
4-[2-(4-amino-1,2,5-oxadiazol-3-yl)-1-ethyl-7-[(3S)-piperidin-3-ylmethoxy]-1H-imidazo[4,5-c]pyridin-4-yl]-2-methylbut-3-yn-2-ol GSK690693 | US10550114, Compound GSK690693
Type:
Small organic molecule
Emp. Form.:
C21H27N7O3
Mol. Mass.:
425.4842
SMILES:
CCn1c(nc2c(ncc(OC[C@H]3CCCNC3)c12)C#CC(C)(C)O)-c1nonc1N
: