Target
RAC-gamma serine/threonine-protein kinase
Ligand
BDBM50316191
Substrate
Meas. Tech.
ChEMBL_628225 (CHEMBL1109954)
IC50
49±n/a nM
Citation
 Rouse, MBSeefeld, MALeber, JDMcNulty, KCSun, LMiller, WHZhang, SMinthorn, EAConcha, NOChoudhry, AESchaber, MDHeerding, DA Aminofurazans as potent inhibitors of AKT kinase. Bioorg Med Chem Lett 19:1508-11 (2009)  
Target
Name:
RAC-gamma serine/threonine-protein kinase
Synonyms:
AKT3 PKB gamma Protein kinase Akt-3 Protein kinase B, gamma RAC-gamma serine/threonine-protein kinase Serine/threonine-protein kinase AKT | Serine/threonine-protein kinase AKT3
Type:
Enzyme
Mol. Mass.:
55769.36
Organism:
Homo sapiens (Human)
Description:
Residue:
479
  
Inhibitor
Name:
BDBM50316191
Synonyms:
4-(2-(4-amino-1,2,5-oxadiazol-3-yl)-6-((S)-2-amino-2-phenylethoxy)-1-ethyl-1H-imidazo[4,5-c]pyridin-4-yl)-2-methylbut-3-yn-2-ol | CHEMBL1096626
Type:
Small organic molecule
Emp. Form.:
C23H25N7O3
Mol. Mass.:
447.4897
SMILES:
CCn1c(nc2c(nc(OC[C@@H](N)c3ccccc3)cc12)C#CC(C)(C)O)-c1nonc1N
: