Target
Glycogen synthase kinase-3 beta
Ligand
BDBM50316197
Substrate
Meas. Tech.
ChEMBL_628226 (CHEMBL1109955)
IC50
30000±n/a nM
Citation
 Rouse, MBSeefeld, MALeber, JDMcNulty, KCSun, LMiller, WHZhang, SMinthorn, EAConcha, NOChoudhry, AESchaber, MDHeerding, DA Aminofurazans as potent inhibitors of AKT kinase. Bioorg Med Chem Lett 19:1508-11 (2009)  
Target
Name:
Glycogen synthase kinase-3 beta
Synonyms:
GSK-3 beta GSK3B Glycogen synthase kinase 3 beta (GSK3B) Glycogen synthase kinase-3 beta (GSK-3B) Glycogen synthase kinase-3 beta (GSK3B) Glycogen synthase kinase-3beta (GSK3B) | Serine/threonine-protein kinase GSK3B
Type:
Enzyme
Mol. Mass.:
46756.38
Organism:
Homo sapiens (Human)
Description:
P49841
Residue:
420
  
Inhibitor
Name:
BDBM50316197
Synonyms:
4-(2-(4-amino-1,2,5-oxadiazol-3-yl)-6-(3-aminopropoxy)-1-ethyl-1H-imidazo[4,5-c]pyridin-4-yl)-2-methylbut-3-yn-2-ol | CHEMBL1096292
Type:
Small organic molecule
Emp. Form.:
C18H23N7O3
Mol. Mass.:
385.4203
SMILES:
CCn1c(nc2c(nc(OCCCN)cc12)C#CC(C)(C)O)-c1nonc1N
: