Target
RAC-alpha serine/threonine-protein kinase
Ligand
BDBM50316189
Substrate
Meas. Tech.
ChEMBL_628223 (CHEMBL1109952)
Ki
6±n/a nM
Citation
 Rouse, MBSeefeld, MALeber, JDMcNulty, KCSun, LMiller, WHZhang, SMinthorn, EAConcha, NOChoudhry, AESchaber, MDHeerding, DA Aminofurazans as potent inhibitors of AKT kinase. Bioorg Med Chem Lett 19:1508-11 (2009)  
Target
Name:
RAC-alpha serine/threonine-protein kinase
Synonyms:
AKT phosphorylation (p-AKT) AKT1/PPP1CA C-AKT PKB alpha Protein kinase B Protein kinase B (Akt 1) Protein kinase B alpha Proto-oncogene Akt (Akt1) Proto-oncogene c-Akt (AKT1) RAC-PK-alpha RAC-alpha serine/threonine-protein kinase (AKT1) | RAC-alpha serine/threonine-protein kinase (pAKT)
Type:
Enzyme
Mol. Mass.:
55681.25
Organism:
Homo sapiens (Human)
Description:
P31749
Residue:
480
  
Inhibitor
Name:
BDBM50316189
Synonyms:
4-(2-(4-amino-1,2,5-oxadiazol-3-yl)-6-(2-aminoethoxy)-1-ethyl-1H-imidazo[4,5-c]pyridin-4-yl)-2-methylbut-3-yn-2-ol | CHEMBL1096291
Type:
Small organic molecule
Emp. Form.:
C17H21N7O3
Mol. Mass.:
371.3937
SMILES:
CCn1c(nc2c(nc(OCCN)cc12)C#CC(C)(C)O)-c1nonc1N
: