Target
Adenosine receptor A2a
Ligand
BDBM50233809
Substrate
Meas. Tech.
ChEMBL_628240 (CHEMBL1110930)
IC50
17±n/a nM
Citation
 Mantell, SJStephenson, PTMonaghan, SMMaw, GNTrevethick, MAYeadon, MWalker, DKSelby, MDBatchelor, DVRozze, SChavaroche, HLemaitre, AWright, KNWhitlock, LStuart, EFWright, PAMacintyre, F SAR of a series of inhaled A(2A) agonists and comparison of inhaled pharmacokinetics in a preclinical model with clinical pharmacokinetic data. Bioorg Med Chem Lett 19:4471-5 (2009)  
Target
Name:
Adenosine receptor A2a
Synonyms:
A2A adenosine receptor (hA2A) ADENOSINE A2 ADORA2 Adenosine A2A receptor (A2AAR)
Type:
G Protein-Coupled Receptor (GPCR)
Mol. Mass.:
44716.46
Organism:
Homo sapiens (Human)
Description:
P29274
Residue:
412
  
Inhibitor
Name:
BDBM50233809
Synonyms:
(2S,3S,4R,5R)-5-(6-(2,2-diphenylethylamino)-2-((3-(2-(piperidin-1-yl)ethyl)ureido)methyl)-9H-purin-9-yl)-N-ethyl-3,4-dihydroxytetrahydrofuran-2-carboxamide CHEMBL401914
Type:
Small organic molecule
Emp. Form.:
C35H45N9O5
Mol. Mass.:
671.7891
SMILES:
CCNC(=O)[C@H]1O[C@H]([C@H](O)[C@@H]1O)n1cnc2c(NCC(c3ccccc3)c3ccccc3)nc(CNC(=O)NCCN3CCCCC3)nc12
: