Target
Adenosine receptor A2a
Ligand
BDBM50316203
Substrate
Meas. Tech.
ChEMBL_628240 (CHEMBL1110930)
IC50
45±n/a nM
Citation
 Mantell, SJStephenson, PTMonaghan, SMMaw, GNTrevethick, MAYeadon, MWalker, DKSelby, MDBatchelor, DVRozze, SChavaroche, HLemaitre, AWright, KNWhitlock, LStuart, EFWright, PAMacintyre, F SAR of a series of inhaled A(2A) agonists and comparison of inhaled pharmacokinetics in a preclinical model with clinical pharmacokinetic data. Bioorg Med Chem Lett 19:4471-5 (2009)  
Target
Name:
Adenosine receptor A2a
Synonyms:
A2A adenosine receptor (hA2A) ADENOSINE A2 ADORA2 Adenosine A2A receptor (A2AAR)
Type:
G Protein-Coupled Receptor (GPCR)
Mol. Mass.:
44716.46
Organism:
Homo sapiens (Human)
Description:
P29274
Residue:
412
  
Inhibitor
Name:
BDBM50316203
Synonyms:
9-((2R,3R,4S,5R)-3,4-dihydroxy-5-(hydroxymethyl)tetrahydrofuran-2-yl)-6-(2,2-diphenylethylamino)-N-(2-(3-(2-(piperidin-1-yl)ethyl)ureido)ethyl)-9H-purine-2-carboxamide | CHEMBL1096887
Type:
Small organic molecule
Emp. Form.:
C35H45N9O6
Mol. Mass.:
687.7885
SMILES:
OC[C@H]1O[C@H]([C@H](O)[C@@H]1O)n1cnc2c(NCC(c3ccccc3)c3ccccc3)nc(nc12)C(=O)NCCNC(=O)NCCN1CCCCC1
: