Target
5-hydroxytryptamine receptor 7
Ligand
BDBM50305261
Substrate
Meas. Tech.
ChEMBL_627791 (CHEMBL1116253)
Ki
8±n/a nM
Citation
 Ivachtchenko, AVMitkin, ODTkachenko, SEOkun, IMKysil, VM 8-Sulfonyl-substituted tetrahydro-1H-pyrido[4,3-b]indoles as 5-HT6 receptor antagonists. Eur J Med Chem 45:782-9 (2010)  
Target
Name:
5-hydroxytryptamine receptor 7
Synonyms:
5-HT-7 5-HT7 5-HT7S 5HT7 HTR7 | Serotonin receptor 7
Type:
G Protein-Coupled Receptor (GPCR)
Mol. Mass.:
53573.08
Organism:
Homo sapiens (Human)
Description:
P34969
Residue:
479
  
Inhibitor
Name:
BDBM50305261
Synonyms:
CHEMBL589390 | Dimebolin
Type:
Small organic molecule
Emp. Form.:
C21H25N3
Mol. Mass.:
319.4433
SMILES:
CN1CCc2c(C1)c1cc(C)ccc1n2CCc1ccc(C)nc1
: