Target
Glutamate receptor 2
Ligand
BDBM50002369
Substrate
Meas. Tech.
ChEMBL_628002 (CHEMBL1105523)
EC50
380000±n/a nM
Citation
 Fleming, JJEngland, PM Developing a complete pharmacology for AMPA receptors: a perspective on subtype-selective ligands. Bioorg Med Chem 18:1381-7 (2010)  
Target
Name:
Glutamate receptor 2
Synonyms:
GRIA2_RAT Glutamate receptor AMPA 2/4 Gria2
Type:
PROTEIN
Mol. Mass.:
98691.74
Organism:
Rattus norvegicus
Description:
ChEMBL_936441
Residue:
883
  
Inhibitor
Name:
BDBM50002369
Synonyms:
(2S-(2alpha,3beta,4beta))-2-carboxy-4-(1-methylethenyl)-3-pyrrolidineacetic acid CHEMBL275040 Digensaeure Kainate L-alpha-kainic acid digenic acid | kainic acid
Type:
Small organic molecule
Emp. Form.:
C10H15NO4
Mol. Mass.:
213.2304
SMILES:
CC(=C)[C@H]1CN[C@@H]([C@H]1CC(O)=O)C(O)=O
: