Target
Glutamate receptor 3
Ligand
BDBM50316376
Substrate
Meas. Tech.
ChEMBL_627984 (CHEMBL1105505)
EC50
1600±n/a nM
Citation
 Fleming, JJEngland, PM Developing a complete pharmacology for AMPA receptors: a perspective on subtype-selective ligands. Bioorg Med Chem 18:1381-7 (2010)  
Target
Name:
Glutamate receptor 3
Synonyms:
AMPA-selective glutamate receptor 3 GLURC GRIA3_HUMAN GluR-C Glutamate receptor 3 Glutamate receptor ionotropic, AMPA 3
Type:
PROTEIN
Mol. Mass.:
101172.14
Organism:
Homo sapiens (Human)
Description:
ChEMBL_468627
Residue:
894
  
Inhibitor
Name:
BDBM50316376
Synonyms:
(S)-2-amino-3-(3-carboxy-5-methyl-4-isoxazolyl)propionic acid CHEMBL602962 | S)-4-(2-amino-2-carboxyethyl)-5-methylisoxazole-3-carboxylic acid
Type:
Small organic molecule
Emp. Form.:
C8H10N2O5
Mol. Mass.:
214.1754
SMILES:
Cc1onc(C(O)=O)c1C[C@H](N)C(O)=O
: