Target
Glutamate receptor 3
Ligand
BDBM50060635
Substrate
Meas. Tech.
ChEMBL_627999 (CHEMBL1105520)
EC50
20900±n/a nM
Citation
 Fleming, JJEngland, PM Developing a complete pharmacology for AMPA receptors: a perspective on subtype-selective ligands. Bioorg Med Chem 18:1381-7 (2010)  
Target
Name:
Glutamate receptor 3
Synonyms:
AMPA-selective glutamate receptor 3 GLURC GRIA3_HUMAN GluR-C Glutamate receptor 3 Glutamate receptor ionotropic, AMPA 3
Type:
PROTEIN
Mol. Mass.:
101172.14
Organism:
Homo sapiens (Human)
Description:
ChEMBL_468627
Residue:
894
  
Inhibitor
Name:
BDBM50060635
Synonyms:
(S)-2-Amino-3-(5-fluoro-2,4-dioxo-3,4-dihydro-2H-pyrimidin-1-yl)-propionic acid (S)-5-Fluorowillardiine CHEMBL123132 | Fluorowillardiine
Type:
Small organic molecule
Emp. Form.:
C7H8FN3O4
Mol. Mass.:
217.1545
SMILES:
N[C@@H](Cn1cc(F)c(=O)[nH]c1=O)C(O)=O
: