Target
Vascular endothelial growth factor receptor 3
Ligand
BDBM50316780
Substrate
Meas. Tech.
ChEMBL_632807 (CHEMBL1105618)
IC50
1660±n/a nM
Citation
 Büttner, ACottin, TXu, JTzagkaroulaki, LGiannis, A Serotonin derivatives as a new class of non-ATP-competitive receptor tyrosine kinase inhibitors. Bioorg Med Chem 18:3387-402 (2010)  
Target
Name:
Vascular endothelial growth factor receptor 3
Synonyms:
FLT-4 Fms-like tyrosine kinase 4 VEGFR-3 VGFR3_HUMAN Vascular endothelial growth factor receptor 3 (VEGFR-3) | Vascular endothelial growth factor receptor 3 (VEGFR3)
Type:
Protein
Mol. Mass.:
152749.58
Organism:
Homo sapiens (Human)
Description:
P35916-2
Residue:
1363
  
Inhibitor
Name:
BDBM50316780
Synonyms:
4-(2-(3-Amino-9-(5-(4-(dimethylamino)phenyl)pentyl)-2,3,4,9-tetrahydro-1H-tetrahydrocarbazole-6-yloxy)ethyl)-phenol dihydrochloride | CHEMBL3216254
Type:
Small organic molecule
Emp. Form.:
C33H43Cl2N3O2
Mol. Mass.:
584.619
SMILES:
Cl.Cl.CN(C)c1ccc(CCCCCn2c3CCC(N)Cc3c3cc(OCCc4ccc(O)cc4)ccc23)cc1
: