Target
Vascular endothelial growth factor receptor 2
Ligand
BDBM50316776
Substrate
Meas. Tech.
ChEMBL_632814 (CHEMBL1111028)
IC50
1170±n/a nM
Citation
 Büttner, ACottin, TXu, JTzagkaroulaki, LGiannis, A Serotonin derivatives as a new class of non-ATP-competitive receptor tyrosine kinase inhibitors. Bioorg Med Chem 18:3387-402 (2010)  
Target
Name:
Vascular endothelial growth factor receptor 2
Synonyms:
CD_antigen=CD309 Fetal liver kinase 1 (FLK-1) KDR Protein-tyrosine kinase receptor Flk-1 VEGFR-2 VEGFR2 Vascular Endothelial Growth Factor Receptor Kinase 2 Vascular endothelial growth factor receptor 2 (KDR) Vascular endothelial growth factor receptor 2 (VEGFR2) Vascular endothelial growth factor receptor-2 (VEGFR-2)
Type:
Receptor Tyrosine Kinase
Mol. Mass.:
151510.97
Organism:
Homo sapiens (Human)
Description:
P35968
Residue:
1356
  
Inhibitor
Name:
BDBM50316776
Synonyms:
2-[5-(4-Hydroxyphenethoxy)-1-(4-phenyl)benzyl-1Hindole-3-yl]ethanamine hydrochloride | CHEMBL1095154
Type:
Small organic molecule
Emp. Form.:
C31H30N2O2
Mol. Mass.:
462.5821
SMILES:
NCCc1cn(Cc2ccc(cc2)-c2ccccc2)c2ccc(OCCc3ccc(O)cc3)cc12
: