Target
D(2) dopamine receptor
Ligand
BDBM50316964
Substrate
Meas. Tech.
ChEMBL_630120 (CHEMBL1113711)
Ki
>10000±n/a nM
Citation
 Fiorino, FSeverino, BDe Angelis, FPerissutti, EMagli, EFrecentese, FEsposito, AMassarelli, PNencini, CSantagada, VCaliendo, G New 5-HT(1A) receptor ligands containing a N'-cyanoisonicotinamidine nucleus: synthesis and in vitro pharmacological evaluation. Bioorg Med Chem Lett 20:2978-82 (2010)  
Target
Name:
D(2) dopamine receptor
Synonyms:
DOPAMINE D2 DOPAMINE D2 Short Dopamine D2 receptor Drd2
Type:
G Protein-Coupled Receptor (GPCR)
Mol. Mass.:
50931.60
Organism:
Rattus norvegicus (rat)
Description:
P61169
Residue:
444
  
Inhibitor
Name:
BDBM50316964
Synonyms:
CHEMBL1086961 | N'-cyano-N-(3-(4-(pyridin-2-yl)piperazin-1-yl)propyl)isonicotinamidine
Type:
Small organic molecule
Emp. Form.:
C19H23N7
Mol. Mass.:
349.4328
SMILES:
N#CNC(=NCCCN1CCN(CC1)c1ccccn1)c1ccncc1
: