Target
Adenosine receptor A1
Ligand
BDBM50317004
Substrate
Meas. Tech.
ChEMBL_630131 (CHEMBL1113722)
Ki
17±n/a nM
Citation
 Shook, BCRassnick, SHall, DRupert, KCHeintzelman, GRHansen, KChakravarty, DBullington, JLScannevin, RHMagliaro, BWestover, LCarroll, KLampron, LRussell, RBranum, SWells, KDamon, SYouells, SLi, XOsbourne, MDemarest, KTang, YRhodes, KJackson, PF Methylene amine substituted arylindenopyrimidines as potent adenosine A(2A)/A(1) antagonists. Bioorg Med Chem Lett 20:2864-7 (2010)  
Target
Name:
Adenosine receptor A1
Synonyms:
A1 adenosine receptor (hA1) AA1R_HUMAN ADORA1 Adenosine A1-receptor Adenosine receptor A1 (hA1) | Adenosine transporter (AdT)
Type:
G Protein-Coupled Receptor (GPCR)
Mol. Mass.:
36520.92
Organism:
Homo sapiens (Human)
Description:
P30542
Residue:
326
  
Inhibitor
Name:
BDBM50317004
Synonyms:
2-amino-4-phenyl-8-((pyrrolidin-1-ylamino)methyl)-5H-indeno[1,2-d]pyrimidin-5-one | CHEMBL1099368
Type:
Small organic molecule
Emp. Form.:
C22H21N5O
Mol. Mass.:
371.435
SMILES:
Nc1nc2-c3cc(CNN4CCCC4)ccc3C(=O)c2c(n1)-c1ccccc1
: