Target
Adenosine receptor A1
Ligand
BDBM50317023
Substrate
Meas. Tech.
ChEMBL_630131 (CHEMBL1113722)
Ki
155±n/a nM
Citation
 Shook, BCRassnick, SHall, DRupert, KCHeintzelman, GRHansen, KChakravarty, DBullington, JLScannevin, RHMagliaro, BWestover, LCarroll, KLampron, LRussell, RBranum, SWells, KDamon, SYouells, SLi, XOsbourne, MDemarest, KTang, YRhodes, KJackson, PF Methylene amine substituted arylindenopyrimidines as potent adenosine A(2A)/A(1) antagonists. Bioorg Med Chem Lett 20:2864-7 (2010)  
Target
Name:
Adenosine receptor A1
Synonyms:
A1 adenosine receptor (hA1) AA1R_HUMAN ADORA1 Adenosine A1-receptor Adenosine receptor A1 (hA1) | Adenosine transporter (AdT)
Type:
G Protein-Coupled Receptor (GPCR)
Mol. Mass.:
36520.92
Organism:
Homo sapiens (Human)
Description:
P30542
Residue:
326
  
Inhibitor
Name:
BDBM50317023
Synonyms:
2-amino-4-(4-fluorophenyl)-9-(morpholinomethyl)-5H-indeno[1,2-d]pyrimidin-5-one | CHEMBL1087463
Type:
Small organic molecule
Emp. Form.:
C22H19FN4O2
Mol. Mass.:
390.4103
SMILES:
Nc1nc2-c3c(cccc3CN3CCOCC3)C(=O)c2c(n1)-c1ccc(F)cc1
: