Target
Beta-secretase 1
Ligand
BDBM50317058
Substrate
Meas. Tech.
ChEMBL_630324 (CHEMBL1109071)
Ki
1±n/a nM
Citation
 Cumming, JBabu, SHuang, YCarrol, CChen, XFavreau, LGreenlee, WGuo, TKennedy, MKuvelkar, RLe, TLi, GMcHugh, NOrth, POzgur, LParker, ESaionz, KStamford, AStrickland, CTadesse, DVoigt, JZhang, LZhang, Q Piperazine sulfonamide BACE1 inhibitors: design, synthesis, and in vivo characterization. Bioorg Med Chem Lett 20:2837-42 (2010)  
Target
Name:
Beta-secretase 1
Synonyms:
ASP2 Aspartyl protease 2 BACE1 Beta-secretase (BACE) Beta-secretase 1 (BACE 1) Beta-secretase 1 (BACE1) Beta-site amyloid precursor protein cleaving enzyme 1 Memapsin-2 beta-Secretase (BACE-1) | beta-Secretase (BACE1)
Type:
Protein
Mol. Mass.:
55755.10
Organism:
Homo sapiens (Human)
Description:
P56817
Residue:
501
  
Inhibitor
Name:
BDBM50317058
Synonyms:
CHEMBL1097351 | N-((1S,2S)-1-((R)-4-(5-chlorothiophen-2-ylsulfonyl)piperazin-2-yl)-3-(3,5-difluorophenyl)-1-hydroxypropan-2-yl)-3-((R)-2-(methoxymethyl)pyrrolidine-1-carbonyl)-5-methylbenzamide
Type:
Small organic molecule
Emp. Form.:
C32H37ClF2N4O6S2
Mol. Mass.:
711.239
SMILES:
COC[C@H]1CCCN1C(=O)c1cc(C)cc(c1)C(=O)N[C@@H](Cc1cc(F)cc(F)c1)[C@H](O)[C@H]1CN(CCN1)S(=O)(=O)c1ccc(Cl)s1
: