Target
11-beta-hydroxysteroid dehydrogenase 1
Ligand
BDBM50317216
Substrate
Meas. Tech.
ChEMBL_631344 (CHEMBL1105681)
Ki
2.4±n/a nM
Citation
 Cheng, HHoffman, JLe, PNair, SKCripps, SMatthews, JSmith, CYang, MKupchinsky, SDress, KEdwards, MCole, BWalters, ELoh, CErmolieff, JFanjul, ABhat, GBHerrera, JPauly, THosea, NPaderes, GRejto, P The development and SAR of pyrrolidine carboxamide 11beta-HSD1 inhibitors. Bioorg Med Chem Lett 20:2897-902 (2010)  
Target
Name:
11-beta-hydroxysteroid dehydrogenase 1
Synonyms:
11-DH 11-beta-Hydroxysteroid Dehydrogenase 1 (11-beta-HSD1) 11-beta-hydroxysteroid dehydrogenase 1 (11HSD1) Corticosteroid 11-beta-dehydrogenase isozyme 1 (11-beta-HSD-1) Corticosteroid 11-beta-dehydrogenase isozyme 1 (11beta-HSD1) HSD11 HSD11L | SDR26C1
Type:
Enzyme
Mol. Mass.:
32409.16
Organism:
Homo sapiens (Human)
Description:
P28845
Residue:
292
  
Inhibitor
Name:
BDBM50317216
Synonyms:
(2R)-N-(adamantan-2-yl)-1-(cyclohexylmethyl)pyrrolidine-2-carboxamide | CHEMBL1097177
Type:
Small organic molecule
Emp. Form.:
C22H36N2O
Mol. Mass.:
344.534
SMILES:
O=C(NC1C2CC3CC(C2)CC1C3)[C@H]1CCCN1CC1CCCCC1
: