Target
Tyrosine-protein kinase ABL1
Ligand
BDBM50317233
Substrate
Meas. Tech.
ChEMBL_631518 (CHEMBL1114752)
IC50
0.4±n/a nM
Citation
 Boschelli, DHWang, DWang, YWu, BHonores, EEBarrios Sosa, ACChaudhary, IGolas, JLucas, JBoschelli, F Optimization of 7-alkene-3-quinolinecarbonitriles as Src kinase inhibitors. Bioorg Med Chem Lett 20:2924-7 (2010)  
Target
Name:
Tyrosine-protein kinase ABL1
Synonyms:
ABL ABL1_HUMAN JTK7 Proto-oncogene tyrosine-protein kinase ABL1 Tyrosine-protein kinase ABL V-abl Abelson murine leukemia viral oncogene homolog 1 p150 | tyrosine-protein kinase ABL1 isoform a
Type:
Enzyme
Mol. Mass.:
122897.30
Organism:
Homo sapiens (Human)
Description:
P00519
Residue:
1130
  
Inhibitor
Name:
BDBM50317233
Synonyms:
(E)-4-(2,4-dichloro-5-methoxyphenylamino)-6-methoxy-7-(4-(4-methylpiperazin-1-yl)but-1-enyl)quinoline-3-carbonitrile | CHEMBL1088240
Type:
Small organic molecule
Emp. Form.:
C27H29Cl2N5O2
Mol. Mass.:
526.457
SMILES:
COc1cc(Nc2c(cnc3cc(\C=C\CCN4CCN(C)CC4)c(OC)cc23)C#N)c(Cl)cc1Cl
: