Target
Bifunctional epoxide hydrolase 2
Ligand
BDBM50317293
Substrate
Meas. Tech.
ChEMBL_631548 (CHEMBL1103913)
IC50
235±n/a nM
Citation
 Anandan, SKGless, RD Exploration of secondary and tertiary pharmacophores in unsymmetrical N,N'-diaryl urea inhibitors of soluble epoxide hydrolase. Bioorg Med Chem Lett 20:2740-4 (2010)  
Target
Name:
Bifunctional epoxide hydrolase 2
Synonyms:
Cytosolic epoxide hydrolase 2 EPHX2 HYES_HUMAN Soluble epoxide hydrolase (sEH) | epoxide hydrolase 2, cytoplasmic
Type:
Enzyme
Mol. Mass.:
62613.07
Organism:
Homo sapiens (Human)
Description:
P34913
Residue:
555
  
Inhibitor
Name:
BDBM50317293
Synonyms:
1-(4-chlorophenyl)-3-(4-(4-morpholinopiperidine-1-carbonyl)phenyl)urea | CHEMBL1087862
Type:
Small organic molecule
Emp. Form.:
C23H27ClN4O3
Mol. Mass.:
442.938
SMILES:
Clc1ccc(NC(=O)Nc2ccc(cc2)C(=O)N2CCC(CC2)N2CCOCC2)cc1
: