Target
Sialidase
Ligand
BDBM50317431
Substrate
Meas. Tech.
ChEMBL_631810 (CHEMBL1109003)
IC50
29540±n/a nM
Citation
 Nguyen, PHNguyen, TNKang, KWNdinteh, DTMbafor, JTKim, YROh, WK Prenylated pterocarpans as bacterial neuraminidase inhibitors. Bioorg Med Chem 18:3335-44 (2010)  
Target
Name:
Sialidase
Synonyms:
NANH_VIBCH | nanH
Type:
PROTEIN
Mol. Mass.:
85590.05
Organism:
Vibrio cholerae
Description:
ChEMBL_631810
Residue:
781
  
Inhibitor
Name:
BDBM50317431
Synonyms:
CHEMBL1098413 | demethylmedicarpin
Type:
Small organic molecule
Emp. Form.:
C15H12O4
Mol. Mass.:
256.2534
SMILES:
Oc1ccc2[C@@H]3COc4cc(O)ccc4[C@@H]3Oc2c1
: