Target
Sialidase
Ligand
BDBM50317433
Substrate
Meas. Tech.
ChEMBL_631810 (CHEMBL1109003)
IC50
64750±n/a nM
Citation
 Nguyen, PHNguyen, TNKang, KWNdinteh, DTMbafor, JTKim, YROh, WK Prenylated pterocarpans as bacterial neuraminidase inhibitors. Bioorg Med Chem 18:3335-44 (2010)  
Target
Name:
Sialidase
Synonyms:
NANH_VIBCH | nanH
Type:
PROTEIN
Mol. Mass.:
85590.05
Organism:
Vibrio cholerae
Description:
ChEMBL_631810
Residue:
781
  
Inhibitor
Name:
BDBM50317433
Synonyms:
CHEMBL1098729 | isoneorautenol
Type:
Small organic molecule
Emp. Form.:
C20H18O4
Mol. Mass.:
322.3545
SMILES:
CC1(C)Oc2cc3O[C@@H]4[C@@H](COc5cc(O)ccc45)c3cc2C=C1
: