Target
Prostaglandin G/H synthase 2
Ligand
BDBM50317922
Substrate
Meas. Tech.
ChEMBL_630411 (CHEMBL1113782)
IC50
3.57±n/a nM
Citation
 Singh, PBhardwaj, A Mono-, di-, and triaryl substituted tetrahydropyrans as cyclooxygenase-2 and tumor growth inhibitors. Synthesis and biological evaluation. J Med Chem 53:3707-17 (2010)  
Target
Name:
Prostaglandin G/H synthase 2
Synonyms:
COX2 Cyclooxygenase-2 (COX-2) PTGS2 Prostaglandin G/H synthase (cyclooxygenase)
Type:
Protein
Mol. Mass.:
68976.98
Organism:
Ovis aries (Sheep)
Description:
Residue:
603
  
Inhibitor
Name:
BDBM50317922
Synonyms:
(2R*,4R*,6S*)-2-(4-Fluorophenyl)tetrahydro-4-phenyl-6-(thiocyanatomethyl)-2H-pyran-4-ol | CHEMBL1096385
Type:
Small organic molecule
Emp. Form.:
C19H18FNO2S
Mol. Mass.:
343.415
SMILES:
O[C@]1(C[C@@H](CSC#N)O[C@H](C1)c1ccc(F)cc1)c1ccccc1
: